>>> libgpg-error 1.45 Downloading
wget --passive-ftp -nd -t 3 -O '/home/autobuild/autobuild/instance-14/output-1/build/.libgpg-error-1.45.tar.bz2.1VnAI9/output' 'https://www.gnupg.org/ftp/gcrypt/libgpg-error/libgpg-error-1.45.tar.bz2' 
--2022-08-24 02:17:38--  https://www.gnupg.org/ftp/gcrypt/libgpg-error/libgpg-error-1.45.tar.bz2
Loaded CA certificate '/etc/ssl/certs/ca-certificates.crt'
Resolving www.gnupg.org (www.gnupg.org)... 217.69.76.60, 2001:aa8:fff1:2100::60
Connecting to www.gnupg.org (www.gnupg.org)|217.69.76.60|:443... connected.
HTTP request sent, awaiting response... 200 OK
Length: 1015954 (992K) [text/plain]
Saving to: '/home/autobuild/autobuild/instance-14/output-1/build/.libgpg-error-1.45.tar.bz2.1VnAI9/output'

     0K .......... .......... .......... .......... ..........  5%  196K 5s
    50K .......... .......... .......... .......... .......... 10%  404K 3s
   100K .......... .......... .......... .......... .......... 15% 9.72M 2s
   150K .......... .......... .......... .......... .......... 20%  412K 2s
   200K .......... .......... .......... .......... .......... 25% 12.0M 2s
   250K .......... .......... .......... .......... .......... 30%  102M 1s
   300K .......... .......... .......... .......... .......... 35%  395K 1s
   350K .......... .......... .......... .......... .......... 40%  410K 1s
   400K .......... .......... .......... .......... .......... 45%  421M 1s
   450K .......... .......... .......... .......... .......... 50%  463M 1s
   500K .......... .......... .......... .......... .......... 55%  418M 1s
   550K .......... .......... .......... .......... .......... 60%  447M 0s
   600K .......... .......... .......... .......... .......... 65%  423M 0s
   650K .......... .......... .......... .......... .......... 70%  470M 0s
   700K .......... .......... .......... .......... .......... 75% 8.59M 0s
   750K .......... .......... .......... .......... .......... 80%  177M 0s
   800K .......... .......... .......... .......... .......... 85%  172M 0s
   850K .......... .......... .......... .......... .......... 90%  174M 0s
   900K .......... .......... .......... .......... .......... 95%  406K 0s
   950K .......... .......... .......... .......... ..        100%  149M=0.9s

2022-08-24 02:17:39 (1.09 MB/s) - '/home/autobuild/autobuild/instance-14/output-1/build/.libgpg-error-1.45.tar.bz2.1VnAI9/output' saved [1015954/1015954]

libgpg-error-1.45.tar.bz2: OK (sha1: fe724ed37b4935964059a47b7c64d5f8246659d8)
libgpg-error-1.45.tar.bz2: OK (sha256: 570f8ee4fb4bff7b7495cff920c275002aea2147e9a1d220c068213267f80a26)
>>> libgpg-error 1.45 Extracting
bzcat /home/autobuild/autobuild/instance-14/dl/libgpg-error/libgpg-error-1.45.tar.bz2 | tar --strip-components=1 -C /home/autobuild/autobuild/instance-14/output-1/build/libgpg-error-1.45   -xf -
>>> libgpg-error 1.45 Patching
>>> libgpg-error 1.45 Updating config.sub and config.guess
for file in config.guess config.sub; do for i in $(find /home/autobuild/autobuild/instance-14/output-1/build/libgpg-error-1.45 -name $file); do cp support/gnuconfig/$file $i; done; done
>>> libgpg-error 1.45 Patching libtool
patching file /home/autobuild/autobuild/instance-14/output-1/build/libgpg-error-1.45/build-aux/ltmain.sh
Hunk #1 succeeded at 1421 (offset 4 lines).
Hunk #2 succeeded at 2967 (offset 4 lines).
Hunk #3 succeeded at 5183 (offset 4 lines).
Hunk #4 succeeded at 5193 (offset 4 lines).
Hunk #5 succeeded at 5475 (offset 4 lines).
Hunk #6 succeeded at 5757 (offset 4 lines).
Hunk #7 succeeded at 6703 (offset 7 lines).
Hunk #8 succeeded at 9297 (offset 23 lines).
>>> libgpg-error 1.45 Configuring
(cd /home/autobuild/autobuild/instance-14/output-1/build/libgpg-error-1.45/ && rm -rf config.cache && PATH="/home/autobuild/autobuild/instance-14/output-1/host/bin:/home/autobuild/autobuild/instance-14/output-1/host/sbin:/usr/local/sbin:/usr/local/bin:/usr/bin:/usr/lib/jvm/default/bin:/usr/bin/site_perl:/usr/bin/vendor_perl:/usr/bin/core_perl" AR="/home/autobuild/autobuild/instance-14/output-1/host/bin/aarch64_be-buildroot-linux-uclibc-gcc-ar" AS="/home/autobuild/autobuild/instance-14/output-1/host/bin/aarch64_be-buildroot-linux-uclibc-as" LD="/home/autobuild/autobuild/instance-14/output-1/host/bin/aarch64_be-buildroot-linux-uclibc-ld" NM="/home/autobuild/autobuild/instance-14/output-1/host/bin/aarch64_be-buildroot-linux-uclibc-gcc-nm" CC="/home/autobuild/autobuild/instance-14/output-1/host/bin/aarch64_be-buildroot-linux-uclibc-gcc" GCC="/home/autobuild/autobuild/instance-14/output-1/host/bin/aarch64_be-buildroot-linux-uclibc-gcc" CPP="/home/autobuild/autobuild/instance-14/output-1/host/bin/aarch64_be-buildroot-linux-uclibc-cpp" CXX="/home/autobuild/autobuild/instance-14/output-1/host/bin/aarch64_be-buildroot-linux-uclibc-g++" FC="/home/autobuild/autobuild/instance-14/output-1/host/bin/aarch64_be-buildroot-linux-uclibc-gfortran" F77="/home/autobuild/autobuild/instance-14/output-1/host/bin/aarch64_be-buildroot-linux-uclibc-gfortran" RANLIB="/home/autobuild/autobuild/instance-14/output-1/host/bin/aarch64_be-buildroot-linux-uclibc-gcc-ranlib" READELF="/home/autobuild/autobuild/instance-14/output-1/host/bin/aarch64_be-buildroot-linux-uclibc-readelf" STRIP="/bin/true" OBJCOPY="/home/autobuild/autobuild/instance-14/output-1/host/bin/aarch64_be-buildroot-linux-uclibc-objcopy" OBJDUMP="/home/autobuild/autobuild/instance-14/output-1/host/bin/aarch64_be-buildroot-linux-uclibc-objdump" AR_FOR_BUILD="/usr/bin/ar" AS_FOR_BUILD="/usr/bin/as" CC_FOR_BUILD="/usr/bin/gcc" GCC_FOR_BUILD="/usr/bin/gcc" CXX_FOR_BUILD="/usr/bin/g++" LD_FOR_BUILD="/usr/bin/ld" CPPFLAGS_FOR_BUILD="-I/home/autobuild/autobuild/instance-14/output-1/host/include" CFLAGS_FOR_BUILD="-O2 -I/home/autobuild/autobuild/instance-14/output-1/host/include" CXXFLAGS_FOR_BUILD="-O2 -I/home/autobuild/autobuild/instance-14/output-1/host/include" LDFLAGS_FOR_BUILD="-L/home/autobuild/autobuild/instance-14/output-1/host/lib -Wl,-rpath,/home/autobuild/autobuild/instance-14/output-1/host/lib" FCFLAGS_FOR_BUILD="" DEFAULT_ASSEMBLER="/home/autobuild/autobuild/instance-14/output-1/host/bin/aarch64_be-buildroot-linux-uclibc-as" DEFAULT_LINKER="/home/autobuild/autobuild/instance-14/output-1/host/bin/aarch64_be-buildroot-linux-uclibc-ld" CPPFLAGS="-D_LARGEFILE_SOURCE -D_LARGEFILE64_SOURCE -D_FILE_OFFSET_BITS=64" CFLAGS="-D_LARGEFILE_SOURCE -D_LARGEFILE64_SOURCE -D_FILE_OFFSET_BITS=64  -O3 -g0  -static" CXXFLAGS="-D_LARGEFILE_SOURCE -D_LARGEFILE64_SOURCE -D_FILE_OFFSET_BITS=64  -O3 -g0  -static -static" LDFLAGS=" -static" FCFLAGS=" -O3 -g0 -static" FFLAGS=" -O3 -g0 -static" PKG_CONFIG="/home/autobuild/autobuild/instance-14/output-1/host/bin/pkg-config" STAGING_DIR="/home/autobuild/autobuild/instance-14/output-1/host/aarch64_be-buildroot-linux-uclibc/sysroot" INTLTOOL_PERL=/usr/bin/perl CXX=no ac_cv_lbl_unaligned_fail=yes ac_cv_func_mmap_fixed_mapped=yes ac_cv_func_memcmp_working=yes ac_cv_have_decl_malloc=yes gl_cv_func_malloc_0_nonnull=yes ac_cv_func_malloc_0_nonnull=yes ac_cv_func_calloc_0_nonnull=yes ac_cv_func_realloc_0_nonnull=yes lt_cv_sys_lib_search_path_spec="" ac_cv_c_bigendian=yes   CONFIG_SITE=/dev/null ./configure --target=aarch64_be-buildroot-linux-uclibc --host=aarch64_be-buildroot-linux-uclibc --build=aarch64-unknown-linux-gnu --prefix=/usr --exec-prefix=/usr --sysconfdir=/etc --localstatedir=/var runstatedir=/run --program-prefix="" --disable-gtk-doc --disable-gtk-doc-html --disable-doc --disable-docs --disable-documentation --with-xmlto=no --with-fop=no --disable-dependency-tracking --enable-ipv6 --disable-nls --enable-static --disable-shared  --disable-tests --host="aarch64-unknown-linux-gnu" --enable-threads )
configure: WARNING: unrecognized options: --disable-gtk-doc, --disable-gtk-doc-html, --disable-docs, --disable-documentation, --with-xmlto, --with-fop, --enable-ipv6
checking for a BSD-compatible install... /usr/bin/install -c
checking whether build environment is sane... yes
checking for a thread-safe mkdir -p... /usr/bin/mkdir -p
checking for gawk... gawk
checking whether make sets $(MAKE)... yes
checking whether make supports nested variables... yes
checking whether to enable maintainer-specific portions of Makefiles... no
checking whether make supports nested variables... (cached) yes
checking build system type... aarch64-unknown-linux-gnu
checking host system type... aarch64-unknown-linux-gnu
configure: autobuild project... libgpg-error
configure: autobuild revision... 1.45
./configure: line 3390: hostname: command not found
configure: autobuild timestamp... 20220824-021740
checking for aarch64-unknown-linux-gnu-gcc... /home/autobuild/autobuild/instance-14/output-1/host/bin/aarch64_be-buildroot-linux-uclibc-gcc
checking whether the C compiler works... yes
checking for C compiler default output file name... a.out
checking for suffix of executables... 
checking whether we are cross compiling... configure: error: in `/home/autobuild/autobuild/instance-14/output-1/build/libgpg-error-1.45':
configure: error: cannot run C compiled programs.
If you meant to cross compile, use `--host'.
See `config.log' for more details
make: *** [package/pkg-generic.mk:283: /home/autobuild/autobuild/instance-14/output-1/build/libgpg-error-1.45/.stamp_configured] Error 1
make: Leaving directory '/home/autobuild/autobuild/instance-14/buildroot'